{"text_format":"1","workbook":"xlsx","n_sheets":3,"sheets":["Shopping","Stock","Lists"],"not_rendered":{"charts":0,"images":0,"macros":1,"external_links":0,"defined_names":0,"comments":1,"pivot_tables":0},"unopened":[],"bounds":{"document_bytes":16777216,"sheet_cells":100000,"rows_first":2000,"rows_last":500,"rows_between":2000,"halvings":0,"cell_chars":16384,"cell_head_chars":4096},"cells_cut":0,"cells_raw":0,"read":"whole","date_system":"1900"}

{"sheet":"Shopping","index":0,"n_rows":207,"n_cols":6,"rows_kept":207,"cut":false,"hidden":false,"merged":[[1,1,3,4],[1,5,3,5]]}
[]
[null,"Shopping List",null,null,null,"SORT BUTTONS"]
[]
[]
[]
[null,"Product List","Available From","gm / ml","Shop"]
[null,{"$f":"Stock!B74","v":"Black Pepper Whole"},{"$f":"Stock!H74","v":"The Spice Rack"},{"$f":"IF(Stock!C74=\"-\",IF(Stock!D74>0,Stock!D74,\"-\"),Stock!C74)","v":25},{"$f":"IF(Stock!$F74<=Stock!$G74,0,1)","v":1}]
[null,{"$f":"Stock!B22","v":"Oil Olive"},{"$f":"Stock!H22","v":"Lidl"},{"$f":"IF(Stock!C22=\"-\",IF(Stock!D22>0,Stock!D22,\"-\"),Stock!C22)","v":200},{"$f":"IF(Stock!$F22<=Stock!$G22,0,1)","v":0}]
[null,{"$f":"Stock!B41","v":"Biscuits Various"},{"$f":"Stock!H41","v":"Sainsbury"},{"$f":"IF(Stock!C41=\"-\",IF(Stock!D41>0,Stock!D41,\"-\"),Stock!C41)","v":"-"},{"$f":"IF(Stock!$F41<=Stock!$G41,0,1)","v":1}]
[null,{"$f":"Stock!B77","v":"Bread Rolls X12"},{"$f":"Stock!H77","v":"Toms Bakery"},{"$f":"IF(Stock!C77=\"-\",IF(Stock!D77>0,Stock!D77,\"-\"),Stock!C77)","v":"-"},{"$f":"IF(Stock!$F77<=Stock!$G77,0,1)","v":1}]
[null,{"$f":"Stock!B78","v":"French Stick"},{"$f":"Stock!H78","v":"Toms Bakery"},{"$f":"IF(Stock!C78=\"-\",IF(Stock!D78>0,Stock!D78,\"-\"),Stock!C78)","v":"-"},{"$f":"IF(Stock!$F78<=Stock!$G78,0,1)","v":1}]
[null,{"$f":"Stock!B79","v":0},{"$f":"Stock!H79","v":0},{"$f":"IF(Stock!C79=\"-\",IF(Stock!D79>0,Stock!D79,\"-\"),Stock!C79)","v":"-"},{"$f":"IF(Stock!$F79<=Stock!$G79,0,1)","v":1}]
[null,{"$f":"Stock!B80","v":0},{"$f":"Stock!H80","v":0},{"$f":"IF(Stock!C80=\"-\",IF(Stock!D80>0,Stock!D80,\"-\"),Stock!C80)","v":"-"},{"$f":"IF(Stock!$F80<=Stock!$G80,0,1)","v":1}]
[null,{"$f":"Stock!B81","v":0},{"$f":"Stock!H81","v":0},{"$f":"IF(Stock!C81=\"-\",IF(Stock!D81>0,Stock!D81,\"-\"),Stock!C81)","v":"-"},{"$f":"IF(Stock!$F81<=Stock!$G81,0,1)","v":1}]
[null,{"$f":"Stock!B82","v":0},{"$f":"Stock!H82","v":0},{"$f":"IF(Stock!C82=\"-\",IF(Stock!D82>0,Stock!D82,\"-\"),Stock!C82)","v":"-"},{"$f":"IF(Stock!$F82<=Stock!$G82,0,1)","v":1}]
[null,{"$f":"Stock!B83","v":0},{"$f":"Stock!H83","v":0},{"$f":"IF(Stock!C83=\"-\",IF(Stock!D83>0,Stock!D83,\"-\"),Stock!C83)","v":"-"},{"$f":"IF(Stock!$F83<=Stock!$G83,0,1)","v":1}]
[null,{"$f":"Stock!B84","v":0},{"$f":"Stock!H84","v":0},{"$f":"IF(Stock!C84=\"-\",IF(Stock!D84>0,Stock!D84,\"-\"),Stock!C84)","v":"-"},{"$f":"IF(Stock!$F84<=Stock!$G84,0,1)","v":1}]
[null,{"$f":"Stock!B85","v":0},{"$f":"Stock!H85","v":0},{"$f":"IF(Stock!C85=\"-\",IF(Stock!D85>0,Stock!D85,\"-\"),Stock!C85)","v":"-"},{"$f":"IF(Stock!$F85<=Stock!$G85,0,1)","v":1}]
[null,{"$f":"Stock!B86","v":0},{"$f":"Stock!H86","v":0},{"$f":"IF(Stock!C86=\"-\",IF(Stock!D86>0,Stock!D86,\"-\"),Stock!C86)","v":"-"},{"$f":"IF(Stock!$F86<=Stock!$G86,0,1)","v":1}]
[null,{"$f":"Stock!B87","v":0},{"$f":"Stock!H87","v":0},{"$f":"IF(Stock!C87=\"-\",IF(Stock!D87>0,Stock!D87,\"-\"),Stock!C87)","v":"-"},{"$f":"IF(Stock!$F87<=Stock!$G87,0,1)","v":1}]
[null,{"$f":"Stock!B88","v":0},{"$f":"Stock!H88","v":0},{"$f":"IF(Stock!C88=\"-\",IF(Stock!D88>0,Stock!D88,\"-\"),Stock!C88)","v":"-"},{"$f":"IF(Stock!$F88<=Stock!$G88,0,1)","v":1}]
[null,{"$f":"Stock!B89","v":0},{"$f":"Stock!H89","v":0},{"$f":"IF(Stock!C89=\"-\",IF(Stock!D89>0,Stock!D89,\"-\"),Stock!C89)","v":"-"},{"$f":"IF(Stock!$F89<=Stock!$G89,0,1)","v":1}]
[null,{"$f":"Stock!B90","v":0},{"$f":"Stock!H90","v":0},{"$f":"IF(Stock!C90=\"-\",IF(Stock!D90>0,Stock!D90,\"-\"),Stock!C90)","v":"-"},{"$f":"IF(Stock!$F90<=Stock!$G90,0,1)","v":1}]
[null,{"$f":"Stock!B91","v":0},{"$f":"Stock!H91","v":0},{"$f":"IF(Stock!C91=\"-\",IF(Stock!D91>0,Stock!D91,\"-\"),Stock!C91)","v":"-"},{"$f":"IF(Stock!$F91<=Stock!$G91,0,1)","v":1}]
[null,{"$f":"Stock!B92","v":0},{"$f":"Stock!H92","v":0},{"$f":"IF(Stock!C92=\"-\",IF(Stock!D92>0,Stock!D92,\"-\"),Stock!C92)","v":"-"},{"$f":"IF(Stock!$F92<=Stock!$G92,0,1)","v":1}]
[null,{"$f":"Stock!B93","v":0},{"$f":"Stock!H93","v":0},{"$f":"IF(Stock!C93=\"-\",IF(Stock!D93>0,Stock!D93,\"-\"),Stock!C93)","v":"-"},{"$f":"IF(Stock!$F93<=Stock!$G93,0,1)","v":1}]
[null,{"$f":"Stock!B94","v":0},{"$f":"Stock!H94","v":0},{"$f":"IF(Stock!C94=\"-\",IF(Stock!D94>0,Stock!D94,\"-\"),Stock!C94)","v":"-"},{"$f":"IF(Stock!$F94<=Stock!$G94,0,1)","v":1}]
[null,{"$f":"Stock!B95","v":0},{"$f":"Stock!H95","v":0},{"$f":"IF(Stock!C95=\"-\",IF(Stock!D95>0,Stock!D95,\"-\"),Stock!C95)","v":"-"},{"$f":"IF(Stock!$F95<=Stock!$G95,0,1)","v":1}]
[null,{"$f":"Stock!B96","v":0},{"$f":"Stock!H96","v":0},{"$f":"IF(Stock!C96=\"-\",IF(Stock!D96>0,Stock!D96,\"-\"),Stock!C96)","v":"-"},{"$f":"IF(Stock!$F96<=Stock!$G96,0,1)","v":1}]
[null,{"$f":"Stock!B97","v":0},{"$f":"Stock!H97","v":0},{"$f":"IF(Stock!C97=\"-\",IF(Stock!D97>0,Stock!D97,\"-\"),Stock!C97)","v":"-"},{"$f":"IF(Stock!$F97<=Stock!$G97,0,1)","v":1}]
[null,{"$f":"Stock!B98","v":0},{"$f":"Stock!H98","v":0},{"$f":"IF(Stock!C98=\"-\",IF(Stock!D98>0,Stock!D98,\"-\"),Stock!C98)","v":"-"},{"$f":"IF(Stock!$F98<=Stock!$G98,0,1)","v":1}]
[null,{"$f":"Stock!B99","v":0},{"$f":"Stock!H99","v":0},{"$f":"IF(Stock!C99=\"-\",IF(Stock!D99>0,Stock!D99,\"-\"),Stock!C99)","v":"-"},{"$f":"IF(Stock!$F99<=Stock!$G99,0,1)","v":1}]
[null,{"$f":"Stock!B100","v":0},{"$f":"Stock!H100","v":0},{"$f":"IF(Stock!C100=\"-\",IF(Stock!D100>0,Stock!D100,\"-\"),Stock!C100)","v":"-"},{"$f":"IF(Stock!$F100<=Stock!$G100,0,1)","v":1}]
[null,{"$f":"Stock!B101","v":0},{"$f":"Stock!H101","v":0},{"$f":"IF(Stock!C101=\"-\",IF(Stock!D101>0,Stock!D101,\"-\"),Stock!C101)","v":"-"},{"$f":"IF(Stock!$F101<=Stock!$G101,0,1)","v":1}]
[null,{"$f":"Stock!B102","v":0},{"$f":"Stock!H102","v":0},{"$f":"IF(Stock!C102=\"-\",IF(Stock!D102>0,Stock!D102,\"-\"),Stock!C102)","v":"-"},{"$f":"IF(Stock!$F102<=Stock!$G102,0,1)","v":1}]
[null,{"$f":"Stock!B103","v":0},{"$f":"Stock!H103","v":0},{"$f":"IF(Stock!C103=\"-\",IF(Stock!D103>0,Stock!D103,\"-\"),Stock!C103)","v":"-"},{"$f":"IF(Stock!$F103<=Stock!$G103,0,1)","v":1}]
[null,{"$f":"Stock!B104","v":0},{"$f":"Stock!H104","v":0},{"$f":"IF(Stock!C104=\"-\",IF(Stock!D104>0,Stock!D104,\"-\"),Stock!C104)","v":"-"},{"$f":"IF(Stock!$F104<=Stock!$G104,0,1)","v":1}]
[null,{"$f":"Stock!B105","v":0},{"$f":"Stock!H105","v":0},{"$f":"IF(Stock!C105=\"-\",IF(Stock!D105>0,Stock!D105,\"-\"),Stock!C105)","v":"-"},{"$f":"IF(Stock!$F105<=Stock!$G105,0,1)","v":1}]
[null,{"$f":"Stock!B106","v":0},{"$f":"Stock!H106","v":0},{"$f":"IF(Stock!C106=\"-\",IF(Stock!D106>0,Stock!D106,\"-\"),Stock!C106)","v":"-"},{"$f":"IF(Stock!$F106<=Stock!$G106,0,1)","v":1}]
[null,{"$f":"Stock!B107","v":0},{"$f":"Stock!H107","v":0},{"$f":"IF(Stock!C107=\"-\",IF(Stock!D107>0,Stock!D107,\"-\"),Stock!C107)","v":"-"},{"$f":"IF(Stock!$F107<=Stock!$G107,0,1)","v":1}]
[null,{"$f":"Stock!B108","v":0},{"$f":"Stock!H108","v":0},{"$f":"IF(Stock!C108=\"-\",IF(Stock!D108>0,Stock!D108,\"-\"),Stock!C108)","v":"-"},{"$f":"IF(Stock!$F108<=Stock!$G108,0,1)","v":1}]
[null,{"$f":"Stock!B109","v":0},{"$f":"Stock!H109","v":0},{"$f":"IF(Stock!C109=\"-\",IF(Stock!D109>0,Stock!D109,\"-\"),Stock!C109)","v":"-"},{"$f":"IF(Stock!$F109<=Stock!$G109,0,1)","v":1}]
[null,{"$f":"Stock!B110","v":0},{"$f":"Stock!H110","v":0},{"$f":"IF(Stock!C110=\"-\",IF(Stock!D110>0,Stock!D110,\"-\"),Stock!C110)","v":"-"},{"$f":"IF(Stock!$F110<=Stock!$G110,0,1)","v":1}]
[null,{"$f":"Stock!B111","v":0},{"$f":"Stock!H111","v":0},{"$f":"IF(Stock!C111=\"-\",IF(Stock!D111>0,Stock!D111,\"-\"),Stock!C111)","v":"-"},{"$f":"IF(Stock!$F111<=Stock!$G111,0,1)","v":1}]
[null,{"$f":"Stock!B112","v":0},{"$f":"Stock!H112","v":0},{"$f":"IF(Stock!C112=\"-\",IF(Stock!D112>0,Stock!D112,\"-\"),Stock!C112)","v":"-"},{"$f":"IF(Stock!$F112<=Stock!$G112,0,1)","v":1}]
[null,{"$f":"Stock!B113","v":0},{"$f":"Stock!H113","v":0},{"$f":"IF(Stock!C113=\"-\",IF(Stock!D113>0,Stock!D113,\"-\"),Stock!C113)","v":"-"},{"$f":"IF(Stock!$F113<=Stock!$G113,0,1)","v":1}]
[null,{"$f":"Stock!B114","v":0},{"$f":"Stock!H114","v":0},{"$f":"IF(Stock!C114=\"-\",IF(Stock!D114>0,Stock!D114,\"-\"),Stock!C114)","v":"-"},{"$f":"IF(Stock!$F114<=Stock!$G114,0,1)","v":1}]
[null,{"$f":"Stock!B115","v":0},{"$f":"Stock!H115","v":0},{"$f":"IF(Stock!C115=\"-\",IF(Stock!D115>0,Stock!D115,\"-\"),Stock!C115)","v":"-"},{"$f":"IF(Stock!$F115<=Stock!$G115,0,1)","v":1}]
[null,{"$f":"Stock!B116","v":0},{"$f":"Stock!H116","v":0},{"$f":"IF(Stock!C116=\"-\",IF(Stock!D116>0,Stock!D116,\"-\"),Stock!C116)","v":"-"},{"$f":"IF(Stock!$F116<=Stock!$G116,0,1)","v":1}]
[null,{"$f":"Stock!B117","v":0},{"$f":"Stock!H117","v":0},{"$f":"IF(Stock!C117=\"-\",IF(Stock!D117>0,Stock!D117,\"-\"),Stock!C117)","v":"-"},{"$f":"IF(Stock!$F117<=Stock!$G117,0,1)","v":1}]
[null,{"$f":"Stock!B118","v":0},{"$f":"Stock!H118","v":0},{"$f":"IF(Stock!C118=\"-\",IF(Stock!D118>0,Stock!D118,\"-\"),Stock!C118)","v":"-"},{"$f":"IF(Stock!$F118<=Stock!$G118,0,1)","v":1}]
[null,{"$f":"Stock!B119","v":0},{"$f":"Stock!H119","v":0},{"$f":"IF(Stock!C119=\"-\",IF(Stock!D119>0,Stock!D119,\"-\"),Stock!C119)","v":"-"},{"$f":"IF(Stock!$F119<=Stock!$G119,0,1)","v":1}]
[null,{"$f":"Stock!B120","v":0},{"$f":"Stock!H120","v":0},{"$f":"IF(Stock!C120=\"-\",IF(Stock!D120>0,Stock!D120,\"-\"),Stock!C120)","v":"-"},{"$f":"IF(Stock!$F120<=Stock!$G120,0,1)","v":1}]
[null,{"$f":"Stock!B121","v":0},{"$f":"Stock!H121","v":0},{"$f":"IF(Stock!C121=\"-\",IF(Stock!D121>0,Stock!D121,\"-\"),Stock!C121)","v":"-"},{"$f":"IF(Stock!$F121<=Stock!$G121,0,1)","v":1}]
[null,{"$f":"Stock!B122","v":0},{"$f":"Stock!H122","v":0},{"$f":"IF(Stock!C122=\"-\",IF(Stock!D122>0,Stock!D122,\"-\"),Stock!C122)","v":"-"},{"$f":"IF(Stock!$F122<=Stock!$G122,0,1)","v":1}]
[null,{"$f":"Stock!B123","v":0},{"$f":"Stock!H123","v":0},{"$f":"IF(Stock!C123=\"-\",IF(Stock!D123>0,Stock!D123,\"-\"),Stock!C123)","v":"-"},{"$f":"IF(Stock!$F123<=Stock!$G123,0,1)","v":1}]
[null,{"$f":"Stock!B124","v":0},{"$f":"Stock!H124","v":0},{"$f":"IF(Stock!C124=\"-\",IF(Stock!D124>0,Stock!D124,\"-\"),Stock!C124)","v":"-"},{"$f":"IF(Stock!$F124<=Stock!$G124,0,1)","v":1}]
[null,{"$f":"Stock!B125","v":0},{"$f":"Stock!H125","v":0},{"$f":"IF(Stock!C125=\"-\",IF(Stock!D125>0,Stock!D125,\"-\"),Stock!C125)","v":"-"},{"$f":"IF(Stock!$F125<=Stock!$G125,0,1)","v":1}]
[null,{"$f":"Stock!B126","v":0},{"$f":"Stock!H126","v":0},{"$f":"IF(Stock!C126=\"-\",IF(Stock!D126>0,Stock!D126,\"-\"),Stock!C126)","v":"-"},{"$f":"IF(Stock!$F126<=Stock!$G126,0,1)","v":1}]
[null,{"$f":"Stock!B127","v":0},{"$f":"Stock!H127","v":0},{"$f":"IF(Stock!C127=\"-\",IF(Stock!D127>0,Stock!D127,\"-\"),Stock!C127)","v":"-"},{"$f":"IF(Stock!$F127<=Stock!$G127,0,1)","v":1}]
[null,{"$f":"Stock!B128","v":0},{"$f":"Stock!H128","v":0},{"$f":"IF(Stock!C128=\"-\",IF(Stock!D128>0,Stock!D128,\"-\"),Stock!C128)","v":"-"},{"$f":"IF(Stock!$F128<=Stock!$G128,0,1)","v":1}]
[null,{"$f":"Stock!B129","v":0},{"$f":"Stock!H129","v":0},{"$f":"IF(Stock!C129=\"-\",IF(Stock!D129>0,Stock!D129,\"-\"),Stock!C129)","v":"-"},{"$f":"IF(Stock!$F129<=Stock!$G129,0,1)","v":1}]
[null,{"$f":"Stock!B130","v":0},{"$f":"Stock!H130","v":0},{"$f":"IF(Stock!C130=\"-\",IF(Stock!D130>0,Stock!D130,\"-\"),Stock!C130)","v":"-"},{"$f":"IF(Stock!$F130<=Stock!$G130,0,1)","v":1}]
[null,{"$f":"Stock!B131","v":0},{"$f":"Stock!H131","v":0},{"$f":"IF(Stock!C131=\"-\",IF(Stock!D131>0,Stock!D131,\"-\"),Stock!C131)","v":"-"},{"$f":"IF(Stock!$F131<=Stock!$G131,0,1)","v":1}]
[null,{"$f":"Stock!B132","v":0},{"$f":"Stock!H132","v":0},{"$f":"IF(Stock!C132=\"-\",IF(Stock!D132>0,Stock!D132,\"-\"),Stock!C132)","v":"-"},{"$f":"IF(Stock!$F132<=Stock!$G132,0,1)","v":1}]
[null,{"$f":"Stock!B133","v":0},{"$f":"Stock!H133","v":0},{"$f":"IF(Stock!C133=\"-\",IF(Stock!D133>0,Stock!D133,\"-\"),Stock!C133)","v":"-"},{"$f":"IF(Stock!$F133<=Stock!$G133,0,1)","v":1}]
[null,{"$f":"Stock!B134","v":0},{"$f":"Stock!H134","v":0},{"$f":"IF(Stock!C134=\"-\",IF(Stock!D134>0,Stock!D134,\"-\"),Stock!C134)","v":"-"},{"$f":"IF(Stock!$F134<=Stock!$G134,0,1)","v":1}]
[null,{"$f":"Stock!B135","v":0},{"$f":"Stock!H135","v":0},{"$f":"IF(Stock!C135=\"-\",IF(Stock!D135>0,Stock!D135,\"-\"),Stock!C135)","v":"-"},{"$f":"IF(Stock!$F135<=Stock!$G135,0,1)","v":1}]
[null,{"$f":"Stock!B136","v":0},{"$f":"Stock!H136","v":0},{"$f":"IF(Stock!C136=\"-\",IF(Stock!D136>0,Stock!D136,\"-\"),Stock!C136)","v":"-"},{"$f":"IF(Stock!$F136<=Stock!$G136,0,1)","v":1}]
[null,{"$f":"Stock!B137","v":0},{"$f":"Stock!H137","v":0},{"$f":"IF(Stock!C137=\"-\",IF(Stock!D137>0,Stock!D137,\"-\"),Stock!C137)","v":"-"},{"$f":"IF(Stock!$F137<=Stock!$G137,0,1)","v":1}]
[null,{"$f":"Stock!B138","v":0},{"$f":"Stock!H138","v":0},{"$f":"IF(Stock!C138=\"-\",IF(Stock!D138>0,Stock!D138,\"-\"),Stock!C138)","v":"-"},{"$f":"IF(Stock!$F138<=Stock!$G138,0,1)","v":1}]
[null,{"$f":"Stock!B139","v":0},{"$f":"Stock!H139","v":0},{"$f":"IF(Stock!C139=\"-\",IF(Stock!D139>0,Stock!D139,\"-\"),Stock!C139)","v":"-"},{"$f":"IF(Stock!$F139<=Stock!$G139,0,1)","v":1}]
[null,{"$f":"Stock!B140","v":0},{"$f":"Stock!H140","v":0},{"$f":"IF(Stock!C140=\"-\",IF(Stock!D140>0,Stock!D140,\"-\"),Stock!C140)","v":"-"},{"$f":"IF(Stock!$F140<=Stock!$G140,0,1)","v":1}]
[null,{"$f":"Stock!B141","v":0},{"$f":"Stock!H141","v":0},{"$f":"IF(Stock!C141=\"-\",IF(Stock!D141>0,Stock!D141,\"-\"),Stock!C141)","v":"-"},{"$f":"IF(Stock!$F141<=Stock!$G141,0,1)","v":1}]
[null,{"$f":"Stock!B142","v":0},{"$f":"Stock!H142","v":0},{"$f":"IF(Stock!C142=\"-\",IF(Stock!D142>0,Stock!D142,\"-\"),Stock!C142)","v":"-"},{"$f":"IF(Stock!$F142<=Stock!$G142,0,1)","v":1}]
[null,{"$f":"Stock!B143","v":0},{"$f":"Stock!H143","v":0},{"$f":"IF(Stock!C143=\"-\",IF(Stock!D143>0,Stock!D143,\"-\"),Stock!C143)","v":"-"},{"$f":"IF(Stock!$F143<=Stock!$G143,0,1)","v":1}]
[null,{"$f":"Stock!B144","v":0},{"$f":"Stock!H144","v":0},{"$f":"IF(Stock!C144=\"-\",IF(Stock!D144>0,Stock!D144,\"-\"),Stock!C144)","v":"-"},{"$f":"IF(Stock!$F144<=Stock!$G144,0,1)","v":1}]
[null,{"$f":"Stock!B145","v":0},{"$f":"Stock!H145","v":0},{"$f":"IF(Stock!C145=\"-\",IF(Stock!D145>0,Stock!D145,\"-\"),Stock!C145)","v":"-"},{"$f":"IF(Stock!$F145<=Stock!$G145,0,1)","v":1}]
[null,{"$f":"Stock!B146","v":0},{"$f":"Stock!H146","v":0},{"$f":"IF(Stock!C146=\"-\",IF(Stock!D146>0,Stock!D146,\"-\"),Stock!C146)","v":"-"},{"$f":"IF(Stock!$F146<=Stock!$G146,0,1)","v":1}]
[null,{"$f":"Stock!B147","v":0},{"$f":"Stock!H147","v":0},{"$f":"IF(Stock!C147=\"-\",IF(Stock!D147>0,Stock!D147,\"-\"),Stock!C147)","v":"-"},{"$f":"IF(Stock!$F147<=Stock!$G147,0,1)","v":1}]
{"$rows_left_out":128}
{"sheet":"Stock","index":1,"n_rows":207,"n_cols":8,"rows_kept":207,"cut":false,"hidden":false,"merged":[[1,1,3,5],[1,6,3,6]]}
[]
[null,"Cupboard Stock Check",null,null,null,null,"SORT BUTTONS"]
[]
[]
[]
[null,"Product List","Grams","ml","Location","Stock","Re-Stock","Buy From"]
[null,"Sugar Tate Lyle",1000,"-","Cupboard 1",1,1,"Aldi"]
[null,"Pegs","-","-","Cupboard 4",20,5,"Aldi"]
[null,"Peas Frozen",500,"-","Freezer",1,0,"Aldi"]
[null,"Pepperoni Pizza","-","-","Freezer",4,0,"Aldi"]
[null,"Bank  £10  X3 = £30","-","-","Purse Wallet",3,3,"Barclays"]
[null,"Pork Belly",2000,"-","Freezer",2,2,"Butchers"]
[null,"Condoms","-","-","Purse Wallet",2,2,"Chemist"]
[null,"Cod Fillets X4","-","-","Freezer",4,0,"Co-Op"]
[null,"Bananas  X8","-","-","Cupboard 5",3,4,"Farm Shop"]
[null,"Bleach Domestos","-",250,"Bathroom",0,0,"Lidl"]
[null,"Cotton Buds X100","-","-","Bathroom",0,0,"Lidl"]
[null,"Johnson Baby Oil ","-",200,"Bathroom",1,0,"Lidl"]
[null,"Johnsons Baby Lotion","-",200,"Bathroom",0,0,"Lidl"]
[null,"Alpen",210,"-","Cupboard 1",1,0,"Lidl"]
[null,"Shreadies Malt",750,"-","Cupboard 1",1,0,"Lidl"]
[null,"Oil Olive","-",200,"Cupboard 3",0,0,"Lidl"]
[null,"Oil Vegetable","-",200,"Cupboard 3",1,0,"Lidl"]
[null,"Light Bulbs","-","-","Cupboard 4",3,2,"Lidl"]
[null,"Ham Joint",2000,"-","Fridge",0,0,"Lidl"]
[null,"Beer  8 Pack","-","-","Garage Shed",6,3,"Lidl"]
[null,"Toilet Roll Tescos 16","-","-","Garage Shed",12,4,"Lidl"]
[null,"Brussel Sproughts",200,"-","Cupboard 5",1,0,"Market"]
[null,"Carrots ",500,"-","Cupboard 5",1,0,"Market"]
[null,"Courgettes X2","-","-","Cupboard 5",1,0,"Market"]
[null,"Leeks",500,"-","Cupboard 5",1,0,"Market"]
[null,"Lettuce Iceburg","-","-","Cupboard 5",1,0,"Market"]
[null,"Mango  X4","-","-","Cupboard 5",3,1,"Market"]
[null,"Onions ",300,"-","Cupboard 5",1,0,"Market"]
[null,"Papaya","-","-","Cupboard 5",2,1,"Market"]
[null,"Cucumber Half","-","-","Fridge",1,0,"Market"]
[null,"Tomatos Fresh",300,"-","Fridge",1,0,"Market"]
[null,"Bucket","-","-","Garage Shed",1,0,"Market"]
[null,"Simplicity Pads","-","-","Bathroom",1,0,"Sainsbury"]
[null,"Hand Soap","-",250,"Bathroom",1,0,"Sainsbury"]
[null,"Biscuits Various","-","-","Cupboard 1",1,0,"Sainsbury"]
[null,"Mr Kiplings Lemon Slice","-","-","Cupboard 1",2,1,"Sainsbury"]
[null,"Tea Tetley 240","-","-","Cupboard 1",1,0,"Sainsbury"]
[null,"Wheatabix X24","-","-","Cupboard 1",12,6,"Sainsbury"]
[null,"Tomatos Chopped Tin",210,"-","Cupboard 2",1,0,"Sainsbury"]
[null,"Kidney Beans Dried",500,"-","Cupboard 3",1,0,"Sainsbury"]
[null,"Ariel Wash Tablets 36","-","-","Cupboard 4",24,4,"Sainsbury"]
[null,"Dettol Power Spray","-",720,"Cupboard 4",1,0,"Sainsbury"]
[null,"Fairy Liquid","-",300,"Cupboard 4",1,0,"Sainsbury"]
[null,"Peppers  Assorted","-","-","Cupboard 5",0,0,"Sainsbury"]
[null,"Chicken Thighs Fresh",600,"-","Freezer",1,0,"Sainsbury"]
[null,"Chicken Whole Fresh",2000,"-","Freezer",1,1,"Sainsbury"]
[null,"Butter Unsalted",200,"-","Fridge",1,0,"Sainsbury"]
[null,"Prawns Fresh",400,"-","Fridge",1,0,"Sainsbury"]
[null,"Wine","-","-","Garage Shed",3,0,"Sainsbury"]
[null,"Coffee Nescafe Alta Rica",400,"-","Cupboard 1",0,0,"Tesco"]
[null,"Cornflakes",1000,"-","Cupboard 1",1,0,"Tesco"]
[null,"Baked Beans Heinz X4",100,"-","Cupboard 2",1,2,"Tesco"]
[null,"Cadbury Chocolate Drink",200,"-","Cupboard 2",1,0,"Tesco"]
[null,"Tomato Sauce Heinz","-",200,"Cupboard 2",1,0,"Tesco"]
[null,"Flour Plain",1000,"-","Cupboard 3",0,0,"Tesco"]
[null,"Flour Self Raising",1000,"-","Cupboard 3",1,0,"Tesco"]
[null,"Oxo Beef Cube 12","-","-","Cupboard 3",4,4,"Tesco"]
[null,"Oxo Chick Cube X6","-","-","Cupboard 3",8,3,"Tesco"]
[null,"Oxo Veg Cube X6","-","-","Cupboard 3",12,1,"Tesco"]
[null,"Batteries AA 12 pack","-","-","Cupboard 4",5,2,"Tesco"]
[null,"Chocolate","-","-","Cupboard 4",1,0,"Tesco"]
[null,"Potatoes 10kg",5000,"-","Cupboard 5",2,1,"Tesco"]
[null,"Chicken Breast Skinned",320,"-","Freezer",1,0,"Tesco"]
[null,"Chips Frozen McCain",2000,"-","Freezer",2,1,"Tesco"]
[null,"Salmon Fillet X4",400,"-","Freezer",4,0,"Tesco"]
[null,"Ham Sliced",200,"-","Fridge",2,2,"Tesco"]
[null,"Milk Semi  Cravendale","-",2000,"Fridge",1,0,"Tesco"]
[null,"Black Pepper Whole",25,"-","Cupboard 3",1,0,"The Spice Rack"]
[null,"Cinnamon Sticks",10,"-","Cupboard 3",5,1,"The Spice Rack"]
[null,"Baguettes X4","-","-","Pantry",1,0,"Toms Bakery"]
[null,"Bread Rolls X12","-","-","Pantry",6,4,"Toms Bakery"]
[null,"French Stick","-","-","Pantry",1,0,"Toms Bakery"]
[null,null,"-","-",null,1,0]
[null,null,"-","-",null,1,0]
{"$rows_left_out":128}
{"sheet":"Lists","index":2,"n_rows":76,"n_cols":5,"rows_kept":76,"cut":false,"hidden":false,"merged":[[1,2,2,6],[4,4,4,6],[5,4,9,6],[10,4,18,6]]}
[]
[null,null,"Pantry Stock & Shopping List     By Alex@Rocketwaveuk"]
[]
[]
[null,null,"DROP DOWN LISTS HELP",null,"General Description And Useage"]
[null,null,null,null,"This is an aid to help anyone organise and plan their Shopping and Cupboard Storage, It works in 3 main ways ,( 1) to plan your shopping needs , (2) to organise your cupboards, (3) to help you when you shop.  PLEASE NOTE ! You cannot Edit \"Shopping Products\" Only Edit \"Stock List\""]
[null,null,"Shops"]
[null,null,"-"]
[null,null,"Aldi"]
[null,null,"Asda"]
[null,null,"Barclays",null,"You Can use it just as a shopping list by setting restock levels to all zero`s and stock to 1 or zero if you require that item. Or for full use then use restock levels and Stock to the amount you have  in  your cupboards,   this way  you  can always  tell  the amounts you have used so far.  and can plan your meals even when not at home      The restock levels will tell you when you need to buy that item when shopping but using the Shop filter set to Zero and the Available From sorted Assending.                        If You Require Help Contact alex@rocketwaveuk.com"]
[null,null,"Butchers"]
[null,null,"Chemist"]
[null,null,"Co-Op"]
[null,null,"Farm Shop"]
[null,null,"Lidl"]
[null,null,"Market"]
[null,null,"Post Office"]
[null,null,"Sainsbury"]
[null,null,"The Spice Rack"]
[null,null,"Tesco"]
[null,null,"Toms Bakery"]
[]
[]
[null,null,"Grams"]
[null,null,"-"]
[null,null,5]
[null,null,10]
[null,null,25]
[null,null,30]
[null,null,50]
[null,null,100]
[null,null,200]
[null,null,210]
[null,null,300]
[null,null,320]
[null,null,400]
[null,null,500]
[null,null,600]
[null,null,750]
[null,null,1000]
[null,null,2000]
[null,null,3000]
[null,null,5000]
[]
[]
[null,null,"Mltr"]
[null,null,"-"]
[null,null,5]
[null,null,10]
[null,null,50]
[null,null,100]
[null,null,200]
[null,null,250]
[null,null,300]
[null,null,500]
[null,null,720]
[null,null,1000]
[null,null,2000]
[null,null,4000]
[null,null,5000]
[]
[]
[null,null,"Location"]
[null,null,"-"]
[null,null,"Bathroom"]
[null,null,"Cupboard 1"]
[null,null,"Cupboard 2"]
[null,null,"Cupboard 3"]
[null,null,"Cupboard 4"]
[null,null,"Cupboard 5"]
[null,null,"Freezer"]
[null,null,"Fridge"]
[null,null,"Garage Shed"]
[null,null,"Pantry"]
[null,null,"Purse Wallet"]